java Errors

147 entries

Error Code Domain Category Fix Rate Confidence Tier
java.lang.AbstractMethodError — java runtime_error 82% 88% ai_generated
java.lang.ArrayIndexOutOfBoundsException — java runtime_error 95% 96% ai_generated
java.io.IOException: Broken pipe — java io_error 80% 85% ai_generated
error: cannot find symbol — java compilation_error 92% 94% ai_generated
java.lang.ClassFormatError — java runtime_error 78% 84% ai_generated
java.lang.ClassCastException — java runtime_error 90% 92% ai_generated
java.lang.ClassNotFoundException — java runtime_error 88% 90% ai_generated
java.util.ConcurrentModificationException — java runtime_error 92% 94% ai_generated
Unable to acquire connection from pool. Connection pool exhausted — java resource_error 85% 90% ai_generated
Found one Java-level deadlock — java concurrency_error 75% 82% ai_generated
java.lang.IllegalArgumentException: No enum constant — java runtime_error 90% 92% ai_generated
java.lang.ExceptionInInitializerError — java runtime_error 85% 88% ai_generated
java.io.FileNotFoundException — java runtime_error 92% 94% ai_generated
java.lang.OutOfMemoryError: GC overhead limit exceeded — java memory_error 80% 87% ai_generated
FAILURE: Build failed with an exception — java build_error 88% 90% ai_generated
Could not resolve all dependencies for configuration — java build_error 85% 88% ai_generated
Gradle build fails: Could not determine java version — JAVA_HOME path has spaces — java path_handling 88% 90% ai_generated
org.hibernate.LazyInitializationException: could not initialize proxy — java framework_error 88% 90% ai_generated
java.net.http.HttpTimeoutException: request timed out — java network_error 82% 86% ai_generated
java.lang.IllegalAccessError: class X cannot access class Y — java runtime_error 80% 86% ai_generated
java.lang.IllegalStateException — java runtime_error 88% 90% ai_generated
error: incompatible types — java compile_error 95% 96% ai_generated
com.fasterxml.jackson.databind.exc.UnrecognizedPropertyException — java runtime_error 95% 96% ai_generated
java.lang.LinkageError: loader constraint violation: duplicate class definition — java classpath_error 78% 84% ai_generated
java.sql.SQLException: Connection refused — java runtime_error 85% 88% ai_generated
java.lang.UnsatisfiedLinkError: no native library in java.library.path — java native_error 75% 82% ai_generated
org.apache.kafka.common.errors.TimeoutException: Failed to update metadata — java messaging_error 82% 86% ai_generated
java.lang.LinkageError: loader constraint violation — java classpath_error 76% 83% ai_generated
ERROR StatusLogger No Log4j 2 configuration file found ERROR java configuration_error 90% 92% ai_generated
java.nio.charset.MalformedInputException: Input length = 1 — non-ASCII path or filename — java encoding 85% 88% ai_generated
[ERROR] COMPILATION ERROR ERROR java build_error 90% 92% ai_generated
Dependency convergence error — java build_error 85% 88% ai_generated
java.lang.UnsatisfiedLinkError: /path/to/lib.so: libdep.so: cannot open shared object file: No such file or directory — java native_error 82% 87% ai_generated
java.lang.NoClassDefFoundError — java classpath_error 85% 90% ai_generated
java.lang.NoSuchMethodError — java runtime_error 85% 88% ai_generated
java.lang.NullPointerException — java runtime_error 95% 96% ai_generated
javax.persistence.OptimisticLockException: Row was updated or deleted by another transaction — java persistence_error 85% 88% ai_generated
java.lang.OutOfMemoryError: Java heap space — java runtime_error 82% 88% ai_generated
java.lang.OutOfMemoryError: Metaspace — java runtime_error 80% 85% ai_generated
java.lang.reflect.InaccessibleObjectException: Unable to make field accessible: module java.base does not 'opens' to unnamed module — java module_error 85% 88% ai_generated
java.rmi.ConnectException: Connection refused to host — java network_error 80% 85% ai_generated
java.io.InvalidClassException: local class incompatible: stream classdesc serialVersionUID mismatch — java serialization_error 82% 87% ai_generated
java.net.SocketException: Connection reset — java runtime_error 78% 82% ai_generated
org.springframework.beans.factory.UnsatisfiedDependencyException — java framework_error 88% 90% ai_generated
Error creating bean with name 'X': Unsatisfied dependency expressed through constructor parameter — java dependency_injection_error 90% 91% ai_generated
org.springframework.beans.factory.NoSuchBeanDefinitionException — java framework_error 90% 92% ai_generated
org.springframework.beans.factory.BeanCurrentlyInCreationException — java framework_error 85% 88% ai_generated
org.springframework.transaction.TransactionTimedOutException: Transaction timed out: deadline was ... — java framework_error 87% 90% ai_generated
javax.net.ssl.SSLHandshakeException — java runtime_error 82% 85% ai_generated
java.lang.StackOverflowError — java runtime_error 90% 93% ai_generated
java.util.concurrent.RejectedExecutionException: Task rejected from java.util.concurrent.ThreadPoolExecutor — java concurrency_error 85% 88% ai_generated
java.lang.UnsupportedClassVersionError — java runtime_error 95% 96% ai_generated
org.xml.sax.SAXParseException: Content is not allowed in prolog — java parsing_error 90% 92% ai_generated
java.util.zip.ZipException: invalid LOC header (bad signature) — java io_error 83% 86% ai_generated
error: illegal combination of modifiers: 'abstract' and 'final' for a record — java compilation_error 95% 85% ai_generated
WARNING: An illegal reflective access operation has occurred — java module_error 80% 88% ai_generated
error: pattern type 'java.lang.String' is not a subtype of the type of the selector expression 'java.lang.Integer' — java compilation_error 95% 85% ai_generated
javax.net.ssl.SSLPeerUnverifiedException: peer not authenticated — java auth_error 85% 88% ai_generated
error: records cannot extend classes — java compilation_error 95% 85% ai_generated
java.util.IllegalFormatConversionException: d != java.lang.String — java runtime_error 95% 85% ai_generated
java.lang.ClassDefNotFoundException — java runtime_error 80% 85% ai_generated
java.util.MissingResourceException: Can't find bundle for base name messages, locale en_US — java resource_error 85% 88% ai_generated
java.lang.NegativeArraySizeException: -1 — java runtime_error 90% 82% ai_generated
java.io.NotSerializableException: com.example.MyClass — java runtime_error 92% 87% ai_generated
java.lang.StringIndexOutOfBoundsException: String index out of range: 10 — java runtime_error 88% 83% ai_generated
java.net.SocketTimeoutException: Read timed out — java network_error 75% 86% ai_generated
error: cannot find symbol: method X in class Y — java compilation_error 92% 85% ai_generated
java.lang.IllegalThreadStateException — java runtime_error 85% 82% ai_generated
error: incompatible types: X cannot be converted to Y (return type mismatch) — java compilation_error 88% 84% ai_generated
java.util.MissingResourceException: Can't find bundle for base name — java resource_error 90% 83% ai_generated
java.lang.NegativeArraySizeException — java runtime_error 87% 81% ai_generated
javax.net.ssl.SSLException: No available algorithms — java protocol_error 82% 80% ai_generated
java.sql.DataTruncation: Data truncation on column 'X' — java data_error 85% 85% ai_generated
warning: [unchecked] unchecked cast to java.util.List<java.lang.String> — java compilation_error 85% 82% ai_generated
java.lang.AssertionError: expected:<X> but was:<Y> — java assertion_error 90% 85% ai_generated
javax.net.ssl.SSLException: Received fatal alert: certificate_unknown — java auth_error 88% 84% ai_generated
java.util.zip.ZipException: ZIP file must have at least one entry — java io_error 92% 86% ai_generated
javax.net.ssl.SSLException: No appropriate protocol (protocol is disabled or cipher suites are inappropriate) — java network_error 80% 85% ai_generated
java.lang.IllegalAccessError: class X (in module Y) cannot access class Z (in module W) because module W does not export Z to module Y — java module_error 85% 88% ai_generated
java.lang.ClassCastException: class com.sun.proxy.$Proxy0 cannot be cast to class com.example.MyInterface (com.sun.proxy.$Proxy0 is in module java.base of loader 'app'; com.example.MyInterface is in unnamed module of loader 'app') — java type_error 80% 85% ai_generated
org.springframework.transaction.TransactionSystemException: Could not commit JPA transaction; nested exception is javax.persistence.RollbackException: Transaction was rolled back because it has been marked as rollback-only — java runtime_error 85% 87% ai_generated
java.lang.UnsupportedOperationException: null (or with message: ImmutableList does not support modification) — java runtime_error 95% 90% ai_generated
java.lang.ClassFormatError: Constant pool tag 18 is invalid — java runtime_error 85% 85% ai_generated
java.net.SocketException: Too many open files — java resource_error 85% 85% ai_generated
error: unmappable character (0x80) for encoding UTF-8 — java encoding_error 90% 85% ai_generated
javax.net.ssl.SSLException: Unrecognized SSL message, plaintext connection? — java network_error 90% 85% ai_generated
java.lang.UnsupportedOperationException: Immutable list cannot be modified — java runtime_error 95% 85% ai_generated
java.lang.OutOfMemoryError: Direct buffer memory — java runtime_error 80% 85% ai_generated
java.lang.NumberFormatException: For input string: "..." — java type_error 90% 90% ai_generated
java.lang.StringIndexOutOfBoundsException: String index out of range: ... — java runtime_error 92% 87% ai_generated
java.lang.ArithmeticException: / by zero — java runtime_error 95% 90% ai_generated
java.util.InputMismatchException — java type_error 88% 86% ai_generated
java.sql.SQLNonTransientConnectionException: Could not connect to address=(host=<host>)(port=<port>)(type=master): Connection refused — java network_error 85% 85% ai_generated
java.util.zip.ZipException: error in opening zip file — java io_error 82% 88% ai_generated
java.lang.reflect.MalformedParameterizedTypeException — java runtime_error 78% 83% ai_generated
java.lang.ClassCircularityError: <class name> — java module_error 80% 82% ai_generated
javax.net.ssl.SSLException: closing inbound before receiving peer's close_notify — java protocol_error 85% 88% ai_generated
java.lang.UnsupportedClassVersionError: org/example/MyClass has been compiled by a more recent version of the Java Runtime (class file version 61.0), this version of the Java Runtime only recognizes class file versions up to 52.0 — java runtime_error 92% 90% ai_generated
java.sql.SQLException: Lock time out. The lock request timed out because another transaction holds a conflicting lock. DERBY-1000 java resource_error 82% 85% ai_generated
java.lang.AssertionError: expected null, but was: <some value> — java assertion_error 78% 82% ai_generated
Dependency convergence error for com.google.guava:guava:jar:30.1-jre paths to dependency are: — java build_error 88% 87% ai_generated
com.fasterxml.jackson.core.JsonParseException: Unexpected character ('<' (code 60)): expected a valid value (JSON String, Number, Array, Object or token 'null', 'true' or 'false') — java data_error 85% 88% ai_generated
Could not resolve dependency for project com.example:my-app:jar:1.0.0: Could not find artifact com.example:missing-lib:jar:2.0.0 in central (https://repo.maven.apache.org/maven2) — java build_error 80% 85% ai_generated
PluginResolutionException: Plugin [id: 'com.github.johnrengelman.shadow', version: '8.1.1'] was not found in any of the following sources: Gradle Core Plugins, Plugin Repositories (could not resolve plugin artifact 'com.github.johnrengelman.shadow:com.github.johnrengelman.shadow.gradle.plugin:8.1.1') — java build_error 80% 85% ai_generated
Compilation failure: package com.example.util does not exist — java build_error 80% 85% ai_generated
Execution failed for task ':compileJava' > Could not find tools.jar. Please check that /usr/lib/jvm/java-11-openjdk-amd64 contains a valid JDK installation. — java build_error 80% 85% ai_generated
The project com.example:my-app:1.0.0 has a cycle in the dependency graph. Cycle: my-app -> module-a -> module-b -> my-app — java build_error 80% 85% ai_generated
Conflict found for dependency 'com.google.guava:guava' between versions 30.1.1-jre and 31.0.1-jre. Resolve using dependency constraints or force a version. — java build_error 80% 85% ai_generated
Failed to execute goal org.apache.maven.plugins:maven-compiler-plugin:3.10.1:compile (default-compile) on project my-app: Compilation failure: module not found: com.example.util — java build_error 80% 85% ai_generated
Build file 'build.gradle' line: 12, error: Could not find method compile() for arguments [com.example:lib:1.0] on object of type org.gradle.api.internal.artifacts.dsl.dependencies.DefaultDependencyHandler. — java build_error 80% 85% ai_generated
Failed to filter resource 'src/main/resources/application.properties' with value '${db.url}' for project com.example:my-app: Could not resolve placeholder 'db.url' in value '${db.url}' — java build_error 80% 85% ai_generated
Gradle daemon disappeared unexpectedly (may have been killed or may have timed out). The daemon's log file: /home/user/.gradle/daemon/8.5/daemon-12345.out.log — java build_error 80% 85% ai_generated
Invalid version format: '1.0.0-SNAPSHOT ' (trailing whitespace) in dependency com.example:lib:1.0.0-SNAPSHOT — java build_error 80% 85% ai_generated
Could not find method testImplementation() for arguments [junit:junit:4.13.2] on object of type org.gradle.api.internal.artifacts.dsl.dependencies.DefaultDependencyHandler. — java build_error 80% 85% ai_generated
Failed to execute goal org.apache.maven.plugins:maven-surefire-plugin:3.0.0-M7:test (default-test) on project my-app: There are test failures. Please refer to /path/to/surefire-reports for the individual test results. — java build_error 80% 85% ai_generated
Source set 'main' not found in project ':app'. Please make sure the java plugin is applied. — java build_error 80% 85% ai_generated
Failed to validate PGP signature for artifact com.example:signed-lib:1.0.0 from repository central: Signature verification failed: No public key available — java build_error 80% 85% ai_generated
Configuration cache state stored in /home/user/.gradle/configuration-cache is corrupt. Re-run the build with --no-configuration-cache to recover. — java build_error 80% 85% ai_generated
Failed to execute goal org.apache.maven.plugins:maven-site-plugin:3.12.0:site (default-site) on project my-app: Error generating site: java.io.IOException: Unable to create directory /path/to/target/site — java build_error 80% 85% ai_generated
Plugin with id 'org.springframework.boot' not found. Please check that the plugin is correctly declared in the plugins block. — java build_error 80% 85% ai_generated
Could not transfer artifact com.example:lib:1.0.0 from/to central (https://repo.maven.apache.org/maven2): authentication failed for proxy: Proxy authentication required — java network_error 80% 85% ai_generated
Build script '/home/user/project/build.gradle' could not be loaded: Could not open cache directory '/home/user/.gradle/caches/8.5/build-cache-1' (Permission denied) — java system_error 80% 85% ai_generated
Failed to execute goal org.codehaus.mojo:license-maven-plugin:2.0.0:check (default) on project my-app: Some dependencies have incompatible licenses. See /path/to/license-summary.html — java build_error 80% 85% ai_generated
Task 'deploy' not found in project ':app'. Available tasks: assemble, build, clean, jar, test, ... — java build_error 80% 85% ai_generated
Failed to execute goal org.apache.maven.plugins:maven-checkstyle-plugin:3.3.0:check (validate) on project my-app: You have 15 checkstyle violations. For details see /path/to/checkstyle-result.xml — java build_error 80% 85% ai_generated
Settings file 'settings.gradle' not found. Please create one or run Gradle from the root project directory. — java build_error 80% 85% ai_generated
Could not transfer artifact com.example:lib:1.0.0 from/to central (https://repo.maven.apache.org/maven2): Received fatal alert: certificate_unknown. The repository mirror at https://internal-mirror.com/maven2 may be misconfigured. — java network_error 80% 85% ai_generated
java.lang.NullPointerException: Cannot invoke "Object.getClass()" because "answer" is null — java runtime_error 80% 85% ai_generated
org.mockito.exceptions.misusing.UnnecessaryStubbingException: Unnecessary stubbings detected in test class — java runtime_error 80% 88% ai_generated
java.lang.AssertionError: expected: [1, 2, 3] but was: [1, 2, 4] — java data_error 80% 82% ai_generated
org.mockito.exceptions.base.MockitoException: ArgumentCaptor's capture() method was never invoked — java runtime_error 80% 87% ai_generated
org.junit.jupiter.api.extension.ParameterResolutionException: No ParameterResolver registered for parameter [int arg0] in constructor — java config_error 80% 84% ai_generated
org.mockito.exceptions.verification.NoInteractionsWanted: No interactions wanted here. But found these invocations: — java runtime_error 80% 83% ai_generated
org.junit.jupiter.api.extension.TestWatcher: testTimedOut - test timed out after 5000ms — java system_error 80% 81% ai_generated
org.mockito.exceptions.misusing.InvalidUseOfMatchersException: Invalid use of argument matchers! 0 matchers expected, 1 recorded — java runtime_error 80% 86% ai_generated
org.junit.jupiter.api.extension.LifecycleMethodExecutionException: @BeforeAll method 'void setUp()' must be static unless the test class is annotated with @TestInstance(Lifecycle.PER_CLASS) — java config_error 80% 82% ai_generated
org.mockito.exceptions.base.MockitoException: Cannot mock/spy class com.example.FinalClass because Mockito cannot mock final classes — java type_error 80% 88% ai_generated
org.junit.jupiter.api.extension.TestInstantiationException: Test class [com.example.OuterTest$InnerTest] must be a static inner class — java config_error 80% 83% ai_generated
org.mockito.exceptions.stubbing.AnswerException: Exception thrown by answer: java.lang.RuntimeException: test exception — java runtime_error 80% 84% ai_generated
java.lang.AssertionError: Test 'shouldFail' is disabled but still executed? — java config_error 80% 81% ai_generated
org.mockito.exceptions.base.MockitoException: Cannot instantiate @InjectMocks field named 'service' of type 'class com.example.MyService' — java config_error 80% 87% ai_generated
org.opentest4j.AssertionFailedError: Expected java.lang.RuntimeException to be thrown, but java.lang.NullPointerException was thrown — java data_error 80% 82% ai_generated
org.mockito.exceptions.misusing.UnfinishedStubbingException: Unfinished stubbing detected here: doReturn().when() — java runtime_error 80% 85% ai_generated
org.junit.jupiter.api.extension.ParameterResolutionException: No ParameterResolver registered for parameter [java.lang.String arg0] in method testFactory — java config_error 80% 83% ai_generated
java.lang.InterruptedException: sleep interrupted — java system_error 80% 81% ai_generated
org.junit.jupiter.api.extension.ExtensionConfigurationException: Extension [com.example.MyExtension] is not registered — java config_error 80% 84% ai_generated
org.mockito.exceptions.misusing.UnfinishedVerificationException: Missing method call for verify(mock) here: — java runtime_error 80% 86% ai_generated